{"text_format":"3","workbook":"xlsx","n_sheets":3,"sheets":["人员信息汇总表","岗位序列码表","职称（职业技能等级）码表"],"not_rendered":{"defined_names":10},"read":"whole","date_system":"1900"}

{"sheet":"人员信息汇总表","index":0,"n_rows":6,"n_cols":29,"rows_kept":6,"merged":[[0,1,0,28],[1,0,2,0],[1,1,2,1],[1,2,2,2],[1,3,2,3],[1,4,2,4],[1,5,2,5],[1,6,2,6],[1,7,2,7],[1,8,2,8],[1,9,2,9],[1,10,2,10],[1,11,2,11],[1,12,2,12],[1,13,2,13],[1,14,2,14],[1,15,2,15],[1,16,2,16],[1,17,2,17],[1,18,2,18],[1,19,2,19],[1,20,2,20],[1,21,2,21],[1,22,2,22],[1,23,2,23],[1,24,2,24],[1,25,1,26],[1,27,2,27],[1,28,2,28],[5,0,5,28]]}
[null,"国家电网有限公司大数据中心2020年社会招聘人员信息汇总表（样表）"]
["姓名","应聘\n岗位\n编号","应聘部门","应聘岗位","性别","籍贯","出生年月","参加工作\n时间","政治\n面貌","全日制\n学历\n学位","全日制\n院校专业","最高\n学历\n学位","最高学历学位院校专业","本专业领域/岗位工作年限","现工作单位及职务","现单位工作时间","现职务\n时间","职务\n级别","是否国网系统内单位员工","近三年绩效等级累计积分及2019年绩效等级是否符合要求\n（适用于国网系统内单位员工）","职称","职业技能等级","相关职业资格认证","是否服从调剂","身份证号","联系方式",null,"通讯地址","备注\n（其他资质、特殊业绩、获奖等情况）"]
[{"$nulls":25},"手机号码","电子邮件"]
["示例：张三","0211",{"$f":"VLOOKUP(B4,岗位序列码表!$A$3:$C$12,2,FALSE)","v":"安全质量\n与合规部"},{"$f":"VLOOKUP(B4,岗位序列码表!$A$3:$C$12,3,FALSE)","v":"网络安全管理岗"},"男","河北\n遵化",1986.03,2011.07,"中共\n党员","研究生\n硕士","xx大学\nxx专业","研究生\n硕士","（最高学历）xx大学xx专业\n（最高学位）xx大学xx专业","xx年","xx公司\nxx部xx岗",2015.07,2017.08,null,"是","是","中级","技师","CPDA数据分析师","是","130280xxxxxxxxxxxx","138xxxxxxxx","xx@xx.xx","xx省xx市xx区xx（具体到门牌号）"]
[null,"请在下拉列表中选择应聘岗位编号",{"$f":"VLOOKUP(B5,岗位序列码表!$A$3:$C$12,2,FALSE)","v":"——"},{"$f":"VLOOKUP(B5,岗位序列码表!$A$3:$C$12,3,FALSE)","v":"——"},{"$nulls":16},"请在下拉列表中选择应聘岗位编号","请在下拉列表中选择应聘岗位编号","请在下拉列表中选择应聘岗位编号"]
["填写说明：\n1.样表模板（含码表）不可修改，请按照表中示例格式填写；\n2.学历一般填写“大专”、“大学”、“研究生”，学位一般填写“学士”、“硕士”、“博士”，学历学位断行；\n3.“国网系统内单位员工”指与国网系统内单位签订劳动合同的员工。"]

{"sheet":"岗位序列码表","index":1,"n_rows":12,"n_cols":3,"rows_kept":12,"merged":[[0,0,0,2]]}
["公开招聘岗位序列"]
["岗位编号","部门（中心）","岗位"]
["请在下拉列表中选择应聘岗位编号","——","——"]
["0211","安全质量\n与合规部","网络安全管理岗"]
["0221","数据分析中心","数据挖掘分析岗"]
["0231","技术支持中心","数据总监"]
["0232","技术支持中心","内设机构负责人\n（处长/副处长）"]
["0233","技术支持中心","数据工程师岗"]
["0234","技术支持中心","架构师/IT工程师岗"]
["0241","设计中心\n（创新中心）","数据模型设计岗"]
["0242","设计中心\n（创新中心）","技术研发岗"]
["0243","设计中心\n（创新中心）","商务策划岗"]

{"sheet":"职称（职业技能等级）码表","index":2,"n_rows":9,"n_cols":3,"rows_kept":9,"merged":[[0,0,0,2]]}
["职称（职业资格等级、职业资格)"]
["职称","职业资格等级","职业资格"]
["请在下拉列表中选择应聘岗位编号","请在下拉列表中选择应聘岗位编号","请在下拉列表中选择应聘岗位编号"]
["无","无","无"]
["正高级","高级技师","数据管理专业人士认证(CDMP)"]
["副高级","技师","CPDA数据分析师"]
["中级","高级工","TOGAF认证架构师"]
["初级","中级工","重要信息系统安全保护人员认证"]
[null,"初级工","注册信息安全专业人员认证"]